{"text_format":"1","workbook":"xlsx","n_sheets":9,"sheets":["Ohjeet","1.Lähtötiedot","2.Suunnittelu","3.Tulokset","Optimointi 1","Optimointi 2","Ruokintasuositukset ja tuet","Tuotantokustannus","Rakennus- ja koneluettelo"],"not_rendered":{"charts":0,"images":1,"macros":1,"external_links":0,"defined_names":77,"comments":0,"pivot_tables":0},"unopened":[],"bounds":{"document_bytes":16777216,"sheet_cells":100000,"rows_first":2000,"rows_last":500,"rows_between":2000,"halvings":0,"cell_chars":16384,"cell_head_chars":4096},"cells_cut":0,"cells_raw":0,"read":"whole","date_system":"1900"}

{"sheet":"Ohjeet","index":0,"n_rows":83,"n_cols":6,"rows_kept":83,"cut":false,"hidden":false,"merged":[[28,1,28,3],[49,1,49,2]]}
[]
[null,"Lihanaudan ruokinnan optimointi loppukasvatuskaudella"]
[null,"Työkalu kasvatuksen kannattavuuden vertailuun eri kasvatusajoilla"]
[]
[null,"Työkalun tarkoitus on helpoittaa naudanlihantuottajaa valitsemaan taloudellisin kasvatustehokkuus maitorotuisten sonnien loppukasvatukseen. "]
[]
[null,"Laskuri vaatii toimiakseen Microsoft Excel 2007:n tai uudemman. Toiminta muissa taulukkolaskentaohjelmissa ei ole varmaa."]
[null,"Excelin Ratkaisin tulee olla asennettuna, jotta laskuri toimisi oikein. "]
[null,null,"Mikäli Ratkaisinta ei löydy Tiedot-välilehdeltä, katso asennusohjeet tämän sivun alareunasta."]
[null,"Laskuri on toteutettu Excel- ohjelman alareunassa näkyviin välilehtiin."]
[null,"Mukaan on liitetty valmiit pohjat tuotantokustannusten sekä kiinteiden kustannusten laskentaan."]
[]
[null,"Kasvatusaikoja verrataan katetuottojen perusteella sekä kasvatettua eläintä, että koko navetan vuoden tulosta vertailemalla."]
[null,"Työkalu laskee halvimman seosrehuyhdistelmän molemmille kasvatusajoille Excelin Ratkaisin- ohjelmalla."]
[null,"Ratkaisijan käyttämä menetelmä on lineaarinen optimointi, joka pyrkii minimoimaan päivittäisen ruokintakustannuksen tiettyjen reunaehtojen puitteissa. "]
[null,"Reunaehtoja ovat:"]
[null,null,"Energian tarpeen täyttyminen"]
[null,null,"Pötsin valkuaistaseen oltava yli -10/ syöty kg KA"]
[null,null,"Kalsiumin tarpeen täyttyminen"]
[null,null,"Fosforin tarpeen täyttyminen"]
{"$rows_left_out":64}
{"sheet":"1.Lähtötiedot","index":1,"n_rows":24,"n_cols":5,"rows_kept":24,"cut":false,"hidden":false,"merged":[]}
[]
[null,"Tiedot katelaskelmaan"]
[]
[null,null,"Määrä","Yksikkö"]
[null,"Tukialue",2]
[null,"Eläinten määrä",100,"kpl"]
[null,"Lihan hinta",3.1,"€/kg"]
[null,"Laskentakorko",5,"%"]
[null,"Työtuntien määrä/v",1800,"h/v"]
[null,"Hyvinvointituki",50,"€/ey"]
[]
[null,"Muuttuvat kustannukset","Hinta"]
[null,"Säilörehun hinta/kg KA",0.12,"€/kg KA"]
[null,"Viljan hinta/ kg",0.18,"€/kg"]
[null,"Kivennäinen hinta/kg",0.55000000000000004,"€/kg"]
[null,"Vasikan hinta",191,"€/ kpl"]
[null,"Muut muuttuvat kust.",5100,"€/v","Muita muuttuvia kustannuksia ovat mm: lääkintä-, energia- ja kuivituskustannukset."]
[]
[null,"Palkkatavoite",15.5,"€/h"]
[]
{"$rows_left_out":5}
{"sheet":"2.Suunnittelu","index":2,"n_rows":31,"n_cols":16,"rows_kept":31,"cut":false,"hidden":false,"merged":[]}
[]
[null,"Suunnittelu"]
[]
[]
[null,"Syötä taulukkoon rehuanalyysin tiedot"]
[null,"Rehut",null,"KA %","MJ","PVT","Ca","P"]
[null,"Karkearehu",null,250,11,39,3.8,3.6]
[null,"Väkirehu",null,860,12.9,-17,0.5,4.0999999999999996]
[null,"Kivennäinen",null,1000,0,0,220,0]
[]
[]
[null,"Vaihtoehto 1",null,null,null,null,null,null,null,"Vaihtoehto 2"]
[]
[null,"Loppukasvatusaika kk",null,null,null,12,null,null,null,"Loppukasvatusaika kk",null,null,null,13]
[null,"Loppukasvatusaika pv",null,null,null,{"$f":"F14*30","v":360},null,null,null,"Loppukasvatusaika pv",null,null,null,{"$f":"N14*30","v":390}]
[null,"Elopaino loppukasvatuskauden alussa",null,null,null,220,null,null,null,"Elopaino loppukasvatuskauden alussa",null,null,null,220]
[null,"Teuraspainotavoite",null,null,null,325,null,null,null,"Teuraspainotavoite",null,null,null,325]
[null,"Elopaino teurasiässä (teuras% 52)",null,null,null,{"$f":"F17*100/52","v":625},null,null,null,"Elopaino teurasiässä (teuras% 52)",null,null,null,{"$f":"N17*100/52","v":625}]
[null,"Bruttokasvu g/pv",null,null,null,{"$f":"(F18-F16)/F15*1000","v":1125},null,null,null,"Bruttokasvu g/pv",null,null,null,{"$f":"(N18-N16)/N15*1000","v":1038.4615384615386}]
[null,"Maksimikasvu",null,null,null,{"$f":"-0.7361*F21+1544.5","v":1233.49775},{"$f":"IF(F20<F19,\"Kasvunopeus liian suuri\",\"\")","v":""},null,null,"Maksimikasvu",null,null,null,{"$f":"-0.7361*N21+1544.5","v":1233.49775},{"$f":"IF(N20<N19,\"Kasvunopeus liian suuri\",\"\")","v":""}]
{"$rows_left_out":12}
{"sheet":"3.Tulokset","index":3,"n_rows":30,"n_cols":10,"rows_kept":30,"cut":false,"hidden":false,"merged":[]}
[]
[null,"Katteiden vertailu",null,null,null,{"$f":"'2.Suunnittelu'!F14","v":12},"KK",null,{"$f":"'2.Suunnittelu'!N14","v":13},"KK"]
[]
[null,null,"a hinta (€)","Yksikkö",null,"Määrä","Yhteensä",null,"Määrä","Yhteensä"]
[null,"Tuotot"]
[null,"Liha",{"$f":"'1.Lähtötiedot'!C7","v":3.1},"kg",null,{"$f":"'2.Suunnittelu'!F17","v":325},{"$f":"C6*F6","v":1007.5},null,{"$f":"'2.Suunnittelu'!N17","v":325},{"$f":"C6*I6","v":1007.5}]
[null,"Tilatuen lisäosa",40,"kpl",null,{"$f":"'2.Suunnittelu'!F22","v":1},{"$f":"C7*F7","v":40},null,{"$f":"'2.Suunnittelu'!N22","v":1.0833333333333333},{"$f":"C7*I7","v":43.333333333333329}]
[null,"Sonnipalkkio",{"$f":"'Ruokintasuositukset ja tuet'!D43","v":132},"eläin/v",null,{"$f":"'2.Suunnittelu'!F22","v":1},{"$f":"C8*F8","v":132},null,{"$f":"'2.Suunnittelu'!N22","v":1.0833333333333333},{"$f":"C8*I8","v":143}]
[null,"Kansallinen ey tuki",{"$f":"VLOOKUP('1.Lähtötiedot'!C5,'Ruokintasuositukset ja tuet'!C44:D45,2)","v":258},"eläin/v",null,{"$f":"'2.Suunnittelu'!F22","v":1},{"$f":"C9*F9","v":258},null,{"$f":"'2.Suunnittelu'!N22","v":1.0833333333333333},{"$f":"C9*I9","v":279.5}]
[null,"Hyvinvointituki",{"$f":"'1.Lähtötiedot'!C10*0.6","v":30},"eläin/v",null,{"$f":"'2.Suunnittelu'!F22","v":1},{"$f":"C10*F10","v":30},null,{"$f":"'2.Suunnittelu'!N22","v":1.0833333333333333},{"$f":"C10*I10","v":32.5}]
[null,"Katetuotto 1",null,null,null,null,{"$f":"SUM(G6:G10)","v":1467.5},null,null,{"$f":"SUM(J6:J10)","v":1505.8333333333333}]
[null,"Muuttuvat kulut"]
[null,"Karkearehut",{"$f":"'1.Lähtötiedot'!C13","v":0.12},"kg KA",null,{"$f":"'2.Suunnittelu'!D27*(360*'2.Suunnittelu'!F22)","v":1853.4779961564723},{"$f":"C13*F13","v":222.41735953877665},null,{"$f":"'2.Suunnittelu'!L27*(360*'2.Suunnittelu'!N22)","v":2577.3543545454559},{"$f":"C13*I13","v":309.2825225454547}]
[null,"Väkirehut",{"$f":"'1.Lähtötiedot'!C14","v":0.18},"kg  ",null,{"$f":"'2.Suunnittelu'!D28*(360*'2.Suunnittelu'!F22)","v":1210.2125614171866},{"$f":"C14*F14","v":217.8382610550936},null,{"$f":"'2.Suunnittelu'!L28*(360*'2.Suunnittelu'!N22)","v":674.34899999999993},{"$f":"C14*I14","v":121.38281999999998}]
[null,"Kivennäinen",{"$f":"'1.Lähtötiedot'!C15","v":0.55000000000000004},"kg",null,{"$f":"'2.Suunnittelu'!D29*(360*'2.Suunnittelu'!F22)","v":48.689442426852999},{"$f":"C15*F15","v":26.77919333476915},null,{"$f":"'2.Suunnittelu'!L29*(360*'2.Suunnittelu'!N22)","v":44.358540694214867},{"$f":"C15*I15","v":24.397197381818177}]
[null,"Rehut yhteensä",null,null,null,null,{"$f":"SUM(G13:G15)","v":467.03481392863944},null,null,{"$f":"SUM(J13:J15)","v":455.06253992727284}]
[null,"Uudistus",{"$f":"'1.Lähtötiedot'!C16","v":191},"kpl",null,1,{"$f":"C17*F17","v":191},null,1,{"$f":"C17*I17","v":191}]
[null,"Muut muuttuvat kustannukset",{"$f":"'1.Lähtötiedot'!C17/'1.Lähtötiedot'!C6","v":51},"yks",null,{"$f":"'2.Suunnittelu'!F22","v":1},{"$f":"C18*F18","v":51},null,{"$f":"'2.Suunnittelu'!N22","v":1.0833333333333333},{"$f":"C18*I18","v":55.249999999999993}]
[null,"Eläinpääoman korko",{"$f":"'1.Lähtötiedot'!C16","v":191},"yks",null,{"$f":"'1.Lähtötiedot'!C8*F2/12","v":5},{"$f":"C19*F19/100","v":9.5500000000000007},null,{"$f":"'1.Lähtötiedot'!C8*I2/12","v":5.416666666666667},{"$f":"C19*I19/100","v":10.345833333333335}]
[null,"Liikepääoman korko (60%)",null,"eur",{"$f":"0.6*(SUM(G13,G14,G15,G18,G23))","v":478.22088835718364},{"$f":"'1.Lähtötiedot'!C8*F2/12","v":5},{"$f":"E20*F20/100","v":23.911044417859184},{"$f":"0.6*(SUM(J13,J14,J15,J18,J23))","v":487.53752395636366},{"$f":"'1.Lähtötiedot'!C8*I2/12","v":5.416666666666667},{"$f":"H20*I20/100","v":26.408282547636368}]
{"$rows_left_out":11}
{"sheet":"Optimointi 1","index":4,"n_rows":12,"n_cols":7,"rows_kept":12,"cut":false,"hidden":false,"merged":[]}
[]
[null,"Optimointi 1"]
[]
[null,null,"väkirehut","karkearehu","Kivennäinen","tarve"]
[null,"energia",{"$f":"'2.Suunnittelu'!E8","v":12.9},{"$f":"'2.Suunnittelu'!E7","v":11},{"$f":"'2.Suunnittelu'!E9","v":0},{"$f":"'2.Suunnittelu'!E31","v":100}]
[null,"PVT",{"$f":"'2.Suunnittelu'!F8","v":-17},{"$f":"'2.Suunnittelu'!F7","v":39},{"$f":"'2.Suunnittelu'!F9","v":0},{"$f":"-10*'2.Suunnittelu'!D31","v":-86.454999999999998}]
[null,"Ca",{"$f":"'2.Suunnittelu'!G8","v":0.5},{"$f":"'2.Suunnittelu'!G7","v":3.8},{"$f":"'2.Suunnittelu'!G9","v":220},{"$f":"'2.Suunnittelu'!G31","v":51}]
[null,"P ",{"$f":"'2.Suunnittelu'!H8","v":4.0999999999999996},{"$f":"'2.Suunnittelu'!H7","v":3.6},{"$f":"'2.Suunnittelu'!H9","v":0},{"$f":"'2.Suunnittelu'!H31","v":28}]
[null,"rajoite",0.2,0.3]
[null,"annos",3.3617015594921851,5.1485499893235342,0.13524845118570278,{"$f":"'2.Suunnittelu'!D31","v":8.6455000000000002},"kg/ka pv"]
[null,"hinta",{"$f":"'1.Lähtötiedot'!C14","v":0.18},{"$f":"'1.Lähtötiedot'!C13","v":0.12},{"$f":"'1.Lähtötiedot'!C15","v":0.55000000000000004}]
[null,"R-kust",{"$f":"C10*C11+D10*D11+E10*E11","v":1.2973189275795538}]

{"sheet":"Optimointi 2","index":5,"n_rows":12,"n_cols":7,"rows_kept":12,"cut":false,"hidden":false,"merged":[]}
[]
[null,"Optimointi 2"]
[]
[null,null,"Väkirehut","Karkearehut","Kivennäinen","tarve"]
[null,"energia",{"$f":"'2.Suunnittelu'!E8","v":12.9},{"$f":"'2.Suunnittelu'!E7","v":11},{"$f":"'2.Suunnittelu'!E9","v":0},{"$f":"'2.Suunnittelu'!M31","v":95}]
[null,"PVT",{"$f":"'2.Suunnittelu'!F8","v":-17},{"$f":"'2.Suunnittelu'!F7","v":39},{"$f":"'2.Suunnittelu'!F9","v":0},{"$f":"-10*'2.Suunnittelu'!L31","v":-86.454999999999998}]
[null,"Ca",{"$f":"'2.Suunnittelu'!G8","v":0.5},{"$f":"'2.Suunnittelu'!G7","v":3.8},{"$f":"'2.Suunnittelu'!G9","v":220},{"$f":"'2.Suunnittelu'!O31","v":51}]
[null,"P ",{"$f":"'2.Suunnittelu'!H8","v":4.0999999999999996},{"$f":"'2.Suunnittelu'!H7","v":3.6},{"$f":"'2.Suunnittelu'!H9","v":0},{"$f":"'2.Suunnittelu'!P31","v":28}]
[null,"rajoite",0.2,0.3]
[null,"annos",1.7290999999999999,6.6086009090909128,0.11373984793388428,{"$f":"'2.Suunnittelu'!L31","v":8.6455000000000002},"kg/ka pv"]
[null,"hinta",{"$f":"'1.Lähtötiedot'!C14","v":0.18},{"$f":"'1.Lähtötiedot'!C13","v":0.12},{"$f":"'1.Lähtötiedot'!C15","v":0.55000000000000004}]
[null,"R-kust",{"$f":"C10*C11+D10*D11+E10*E11","v":1.1668270254545459}]

{"sheet":"Ruokintasuositukset ja tuet","index":6,"n_rows":57,"n_cols":22,"rows_kept":57,"cut":false,"hidden":true,"merged":[[34,0,34,4],[14,15,22,15],[15,18,15,21],[24,0,24,12],[24,15,32,15],[25,1,25,12],[25,18,25,21],[29,0,29,12],[0,0,0,6],[1,0,1,6],[3,0,3,13],[3,15,3,21],[4,1,4,13],[4,15,12,15],[5,18,5,21]]}
["Lihanautojen ruokintasuunnitelma"]
["Ruokintasuositukset"]
[]
["Energiasuositukset",null,null,null,null,null,null,null,null,null,null,null,null,null,null,"Kivennäissuositukset"]
[null,"Kasvu, g/pv",null,null,null,null,null,null,null,null,null,null,null,null,null,"Lisäkasvu 0,5 kg/pv"]
["Elopaino, kg",800,900,1000,1100,1200,1300,1400,1500,1600,1700,1800,1900,2000,null,null,null,"Elopaino,","Kivennäissuositus, g/pv"]
["100-150",39,41,43,46,49,52,55,58,62,67,null,null,null,null,null,null,"kg","Ca","P","Mg","Na"]
["150-200",48,50,53,56,59,63,67,71,75,80,86,null,null,null,null,null,100,15,9,3,3]
["200-250",56,59,62,66,69,73,78,82,87,93,99,106,null,null,null,null,200,18,10,5,5]
["250-300",64,68,71,75,79,84,88,94,99,105,112,120,128,null,null,null,300,21,12,7,6]
["300-350",72,76,80,84,88,93,99,104,111,117,125,133,143,null,null,null,400,27,13,8,8]
["350-400",79,83,88,92,97,103,108,115,122,129,137,146,157,null,null,null,500,33,14,10,10]
["400-450",86,91,95,100,106,112,118,125,132,140,149,159,170,null,null,null,600,38,16,12,12]
["450-500",93,98,103,108,114,120,127,134,142,151,161,171,183]
["500-550",100,105,110,116,122,129,136,144,152,161,172,183,195,null,"Lisäkasvu 1,0 kg/pv"]
["550-600",106,111,117,123,130,137,145,153,162,171,182,194,207,null,null,null,"Elopaino,","Kivennäissuositus, g/pv"]
["600-650",112,118,124,130,137,145,153,161,171,181,193,205,219,null,null,null,"kg","Ca","P","Mg","Na"]
["650-700",118,124,131,137,145,152,161,170,180,191,202,215,null,null,null,null,100,27,16,5,3]
["700-750",124,130,137,144,152,160,169,178,188,200,212,null,null,null,null,null,200,30,17,6,5]
["750-800",130,136,143,151,159,167,176,186,197,208,null,null,null,null,null,null,300,33,19,8,7]
{"$rows_left_out":38}
{"sheet":"Tuotantokustannus","index":7,"n_rows":51,"n_cols":12,"rows_kept":51,"cut":false,"hidden":false,"merged":[[1,1,1,4]]}
[]
[null,"Katetuotto- ja tuotantokustannuslaskelma"]
[null,"Tuotot ja kustannukset €/ha"]
[]
[null,"Rehuvilja","Määrä","Yksikkö","a hinta","Yhteensä €/ha/v",null,"Säilörehu","Määrä","Yksikkö","a hinta","Yhteensä €/ha/v"]
[null,"Tuotot:",null,null,null,null,null,"Tuotot:"]
[null,"Rehuvilja sato ",0,"kg",0,{"$f":"C7*E7","v":0},null,"Nurmisato (kuiva-ainesato!)",0,"kg/KA",0,{"$f":"I7*K7","v":0}]
[null,null,null,"kg",0,{"$f":"C8*E8","v":0},null,null,0,"kg",0,{"$f":"I8*K8","v":0}]
[null,"Tilatuki",1,"ha",0,0,null,"Tilatuki",1,"ha",0,0]
[null,"Lfa-tuki",1,"ha",0,0,null,"Lfa-tuki",1,"ha",0,0]
[null,"Ympäristötuki",1,"ha",0,0,null,"Ympäristötuki",1,"ha",0,0]
[null,"Pohj.tuki",1,"ha",0,0,null,"Pohj.tuki",1,"ha",0,0]
[null,"Yleinen ha tuki",1,"ha",0,0,null,"Yleinen ha tuki",1,"ha",0,0]
[null,"Tilatuen tuotantopalkkio",1,"ha",0,0,null,"Tilatuen tuotantopalkkio",1,"ha",0,0]
[null,"Luomutuki",1,"ha",0,0,null,"Luomutuki",1,"ha",0,0]
[null,"Tuotot yhteensä",null,null,null,{"$f":"SUM(F7:F15)","v":0},null,"Tuotot yhteensä",null,null,null,{"$f":"SUM(L7:L15)","v":0}]
[null,"Muuttuvat kustannukset:",null,null,null,null,null,"Muuttuvat kustannukset:"]
[null,"Ostosiemen",0,"kg",0,{"$f":"C18*E18","v":0},null,"Ostosiemen",0,"kg",0,{"$f":"I18*K18","v":0}]
[null,"Oma siemen",0,"kg",0,{"$f":"C19*E19","v":0},null,"Oma siemen",0,"kg",0,{"$f":"I19*K19","v":0}]
[null,"Kalkitus",0,"t",0,0,null,"Kalkitus",0,"t",0,0]
{"$rows_left_out":32}
{"sheet":"Rakennus- ja koneluettelo","index":8,"n_rows":32,"n_cols":16,"rows_kept":32,"cut":false,"hidden":false,"merged":[]}
[]
[null,"Kone- ja rakennusluettelo ja rakennusten vuotuiset kustannukset"]
[]
[null,"Laskentakorko",0.05]
[null,"Kunnossapitokustannus",0.02,"hankintahinnasta"]
[null,"Vakuutuskustannus",5.0000000000000001E-3,"hankintahinnasta"]
[]
[null,"Rakennnusluettelo","Kestoaika","Jälleenhankinta-arvo","JA% JHA:sta","Jäännös arvo","Korko €/v","Poisto €/v","Kunnossapito €/v","Vakuutus €/v","Säilytys","Vuotuiskustannus yhteensä €/v","Navetan/ peltyön osuus kustannuksista","Vuotuiskustannus yhteensä","Pellon määrä/laskettava kone","Kustannukset/ ha"]
[null,"Kuivaamo",null,null,null,{"$f":"Taulukko1[[#This Row],[Jälleenhankinta-arvo]]*Taulukko1[[#This Row],[JA% JHA:sta]]","v":0},{"$f":"$C$4*(Taulukko1[[#This Row],[Jälleenhankinta-arvo]]+Taulukko1[[#This Row],[Jäännös arvo]])/2","v":0},{"$f":"(Taulukko1[[#This Row],[Jälleenhankinta-arvo]]-Taulukko1[[#This Row],[Jäännös arvo]])/Taulukko1[[#This Row],[Kestoaika]]","v":{"$error":"#DIV/0!"}},{"$f":"$C$5*Taulukko1[[#This Row],[Jälleenhankinta-arvo]]","v":0},{"$f":"$C$6*Taulukko1[[#This Row],[Jälleenhankinta-arvo]]","v":0},null,{"$f":"SUM(G9:K9)","v":{"$error":"#DIV/0!"}},0,{"$f":"Taulukko1[[#This Row],[Vuotuiskustannus yhteensä €/v]]*Taulukko1[[#This Row],[Navetan/ peltyön osuus kustannuksista]]","v":{"$error":"#DIV/0!"}},null,{"$f":"Taulukko1[[#This Row],[Vuotuiskustannus yhteensä]]/Taulukko1[[#This Row],[Pellon määrä/laskettava kone]]","v":{"$error":"#DIV/0!"}}]
[null,"Rehuvarasto",null,null,null,{"$f":"Taulukko1[[#This Row],[Jälleenhankinta-arvo]]*Taulukko1[[#This Row],[JA% JHA:sta]]","v":0},{"$f":"$C$4*(Taulukko1[[#This Row],[Jälleenhankinta-arvo]]+Taulukko1[[#This Row],[Jäännös arvo]])/2","v":0},{"$f":"(Taulukko1[[#This Row],[Jälleenhankinta-arvo]]-Taulukko1[[#This Row],[Jäännös arvo]])/Taulukko1[[#This Row],[Kestoaika]]","v":{"$error":"#DIV/0!"}},{"$f":"$C$5*Taulukko1[[#This Row],[Jälleenhankinta-arvo]]","v":0},{"$f":"$C$6*Taulukko1[[#This Row],[Jälleenhankinta-arvo]]","v":0},null,{"$error":"#DIV/0!"},0,{"$f":"Taulukko1[[#This Row],[Vuotuiskustannus yhteensä €/v]]*Taulukko1[[#This Row],[Navetan/ peltyön osuus kustannuksista]]","v":{"$error":"#DIV/0!"}},null,{"$f":"Taulukko1[[#This Row],[Vuotuiskustannus yhteensä]]/Taulukko1[[#This Row],[Pellon määrä/laskettava kone]]","v":{"$error":"#DIV/0!"}}]
[null,"Kuivaamo",null,null,null,{"$f":"Taulukko1[[#This Row],[Jälleenhankinta-arvo]]*Taulukko1[[#This Row],[JA% JHA:sta]]","v":0},{"$f":"$C$4*(Taulukko1[[#This Row],[Jälleenhankinta-arvo]]+Taulukko1[[#This Row],[Jäännös arvo]])/2","v":0},{"$f":"(Taulukko1[[#This Row],[Jälleenhankinta-arvo]]-Taulukko1[[#This Row],[Jäännös arvo]])/Taulukko1[[#This Row],[Kestoaika]]","v":{"$error":"#DIV/0!"}},{"$f":"$C$5*Taulukko1[[#This Row],[Jälleenhankinta-arvo]]","v":0},{"$f":"$C$6*Taulukko1[[#This Row],[Jälleenhankinta-arvo]]","v":0},null,{"$error":"#DIV/0!"},0,{"$f":"Taulukko1[[#This Row],[Vuotuiskustannus yhteensä €/v]]*Taulukko1[[#This Row],[Navetan/ peltyön osuus kustannuksista]]","v":{"$error":"#DIV/0!"}},null,{"$f":"Taulukko1[[#This Row],[Vuotuiskustannus yhteensä]]/Taulukko1[[#This Row],[Pellon määrä/laskettava kone]]","v":{"$error":"#DIV/0!"}}]
[null,null,null,null,null,{"$f":"Taulukko1[[#This Row],[Jälleenhankinta-arvo]]*Taulukko1[[#This Row],[JA% JHA:sta]]","v":0},{"$f":"$C$4*(Taulukko1[[#This Row],[Jälleenhankinta-arvo]]+Taulukko1[[#This Row],[Jäännös arvo]])/2","v":0},{"$f":"(Taulukko1[[#This Row],[Jälleenhankinta-arvo]]-Taulukko1[[#This Row],[Jäännös arvo]])/Taulukko1[[#This Row],[Kestoaika]]","v":{"$error":"#DIV/0!"}},{"$f":"$C$5*Taulukko1[[#This Row],[Jälleenhankinta-arvo]]","v":0},{"$f":"$C$6*Taulukko1[[#This Row],[Jälleenhankinta-arvo]]","v":0},null,{"$error":"#DIV/0!"},0,{"$f":"Taulukko1[[#This Row],[Vuotuiskustannus yhteensä €/v]]*Taulukko1[[#This Row],[Navetan/ peltyön osuus kustannuksista]]","v":{"$error":"#DIV/0!"}},null,{"$f":"Taulukko1[[#This Row],[Vuotuiskustannus yhteensä]]/Taulukko1[[#This Row],[Pellon määrä/laskettava kone]]","v":{"$error":"#DIV/0!"}}]
[null,null,null,null,null,{"$f":"Taulukko1[[#This Row],[Jälleenhankinta-arvo]]*Taulukko1[[#This Row],[JA% JHA:sta]]","v":0},{"$f":"$C$4*(Taulukko1[[#This Row],[Jälleenhankinta-arvo]]+Taulukko1[[#This Row],[Jäännös arvo]])/2","v":0},{"$f":"(Taulukko1[[#This Row],[Jälleenhankinta-arvo]]-Taulukko1[[#This Row],[Jäännös arvo]])/Taulukko1[[#This Row],[Kestoaika]]","v":{"$error":"#DIV/0!"}},{"$f":"$C$5*Taulukko1[[#This Row],[Jälleenhankinta-arvo]]","v":0},{"$f":"$C$6*Taulukko1[[#This Row],[Jälleenhankinta-arvo]]","v":0},null,{"$error":"#DIV/0!"},0,{"$f":"Taulukko1[[#This Row],[Vuotuiskustannus yhteensä €/v]]*Taulukko1[[#This Row],[Navetan/ peltyön osuus kustannuksista]]","v":{"$error":"#DIV/0!"}},null,{"$f":"Taulukko1[[#This Row],[Vuotuiskustannus yhteensä]]/Taulukko1[[#This Row],[Pellon määrä/laskettava kone]]","v":{"$error":"#DIV/0!"}}]
[null,"Koneluettelo",null,null,null,{"$f":"Taulukko1[[#This Row],[Jälleenhankinta-arvo]]*Taulukko1[[#This Row],[JA% JHA:sta]]","v":0},{"$f":"$C$4*(Taulukko1[[#This Row],[Jälleenhankinta-arvo]]+Taulukko1[[#This Row],[Jäännös arvo]])/2","v":0},{"$f":"(Taulukko1[[#This Row],[Jälleenhankinta-arvo]]-Taulukko1[[#This Row],[Jäännös arvo]])/Taulukko1[[#This Row],[Kestoaika]]","v":{"$error":"#DIV/0!"}},{"$f":"$C$5*Taulukko1[[#This Row],[Jälleenhankinta-arvo]]","v":0},{"$f":"$C$6*Taulukko1[[#This Row],[Jälleenhankinta-arvo]]","v":0},null,{"$error":"#DIV/0!"},0,{"$f":"Taulukko1[[#This Row],[Vuotuiskustannus yhteensä €/v]]*Taulukko1[[#This Row],[Navetan/ peltyön osuus kustannuksista]]","v":{"$error":"#DIV/0!"}},null,{"$f":"Taulukko1[[#This Row],[Vuotuiskustannus yhteensä]]/Taulukko1[[#This Row],[Pellon määrä/laskettava kone]]","v":{"$error":"#DIV/0!"}}]
[null,"Navetan koneet",null,null,null,{"$f":"Taulukko1[[#This Row],[Jälleenhankinta-arvo]]*Taulukko1[[#This Row],[JA% JHA:sta]]","v":0},{"$f":"$C$4*(Taulukko1[[#This Row],[Jälleenhankinta-arvo]]+Taulukko1[[#This Row],[Jäännös arvo]])/2","v":0},{"$f":"(Taulukko1[[#This Row],[Jälleenhankinta-arvo]]-Taulukko1[[#This Row],[Jäännös arvo]])/Taulukko1[[#This Row],[Kestoaika]]","v":{"$error":"#DIV/0!"}},{"$f":"$C$5*Taulukko1[[#This Row],[Jälleenhankinta-arvo]]","v":0},{"$f":"$C$6*Taulukko1[[#This Row],[Jälleenhankinta-arvo]]","v":0},null,{"$f":"SUM(G15:K15)","v":{"$error":"#DIV/0!"}},0,{"$f":"Taulukko1[[#This Row],[Vuotuiskustannus yhteensä €/v]]*Taulukko1[[#This Row],[Navetan/ peltyön osuus kustannuksista]]","v":{"$error":"#DIV/0!"}},null,{"$f":"Taulukko1[[#This Row],[Vuotuiskustannus yhteensä]]/Taulukko1[[#This Row],[Pellon määrä/laskettava kone]]","v":{"$error":"#DIV/0!"}}]
[null,"Traktori",null,null,null,{"$f":"Taulukko1[[#This Row],[Jälleenhankinta-arvo]]*Taulukko1[[#This Row],[JA% JHA:sta]]","v":0},{"$f":"$C$4*(Taulukko1[[#This Row],[Jälleenhankinta-arvo]]+Taulukko1[[#This Row],[Jäännös arvo]])/2","v":0},{"$f":"(Taulukko1[[#This Row],[Jälleenhankinta-arvo]]-Taulukko1[[#This Row],[Jäännös arvo]])/Taulukko1[[#This Row],[Kestoaika]]","v":{"$error":"#DIV/0!"}},{"$f":"$C$5*Taulukko1[[#This Row],[Jälleenhankinta-arvo]]","v":0},{"$f":"$C$6*Taulukko1[[#This Row],[Jälleenhankinta-arvo]]","v":0},null,{"$error":"#DIV/0!"},0,{"$f":"Taulukko1[[#This Row],[Vuotuiskustannus yhteensä €/v]]*Taulukko1[[#This Row],[Navetan/ peltyön osuus kustannuksista]]","v":{"$error":"#DIV/0!"}},null,{"$f":"Taulukko1[[#This Row],[Vuotuiskustannus yhteensä]]/Taulukko1[[#This Row],[Pellon määrä/laskettava kone]]","v":{"$error":"#DIV/0!"}}]
[null,"Puimuri",null,null,null,{"$f":"Taulukko1[[#This Row],[Jälleenhankinta-arvo]]*Taulukko1[[#This Row],[JA% JHA:sta]]","v":0},{"$f":"$C$4*(Taulukko1[[#This Row],[Jälleenhankinta-arvo]]+Taulukko1[[#This Row],[Jäännös arvo]])/2","v":0},{"$f":"(Taulukko1[[#This Row],[Jälleenhankinta-arvo]]-Taulukko1[[#This Row],[Jäännös arvo]])/Taulukko1[[#This Row],[Kestoaika]]","v":{"$error":"#DIV/0!"}},{"$f":"$C$5*Taulukko1[[#This Row],[Jälleenhankinta-arvo]]","v":0},{"$f":"$C$6*Taulukko1[[#This Row],[Jälleenhankinta-arvo]]","v":0},null,{"$error":"#DIV/0!"},0,{"$f":"Taulukko1[[#This Row],[Vuotuiskustannus yhteensä €/v]]*Taulukko1[[#This Row],[Navetan/ peltyön osuus kustannuksista]]","v":{"$error":"#DIV/0!"}},null,{"$f":"Taulukko1[[#This Row],[Vuotuiskustannus yhteensä]]/Taulukko1[[#This Row],[Pellon määrä/laskettava kone]]","v":{"$error":"#DIV/0!"}}]
[null,"Aurat",null,null,null,{"$f":"Taulukko1[[#This Row],[Jälleenhankinta-arvo]]*Taulukko1[[#This Row],[JA% JHA:sta]]","v":0},{"$f":"$C$4*(Taulukko1[[#This Row],[Jälleenhankinta-arvo]]+Taulukko1[[#This Row],[Jäännös arvo]])/2","v":0},{"$f":"(Taulukko1[[#This Row],[Jälleenhankinta-arvo]]-Taulukko1[[#This Row],[Jäännös arvo]])/Taulukko1[[#This Row],[Kestoaika]]","v":{"$error":"#DIV/0!"}},{"$f":"$C$5*Taulukko1[[#This Row],[Jälleenhankinta-arvo]]","v":0},{"$f":"$C$6*Taulukko1[[#This Row],[Jälleenhankinta-arvo]]","v":0},null,{"$error":"#DIV/0!"},0,{"$f":"Taulukko1[[#This Row],[Vuotuiskustannus yhteensä €/v]]*Taulukko1[[#This Row],[Navetan/ peltyön osuus kustannuksista]]","v":{"$error":"#DIV/0!"}},null,{"$f":"Taulukko1[[#This Row],[Vuotuiskustannus yhteensä]]/Taulukko1[[#This Row],[Pellon määrä/laskettava kone]]","v":{"$error":"#DIV/0!"}}]
[null,"Äes",null,null,null,{"$f":"Taulukko1[[#This Row],[Jälleenhankinta-arvo]]*Taulukko1[[#This Row],[JA% JHA:sta]]","v":0},{"$f":"$C$4*(Taulukko1[[#This Row],[Jälleenhankinta-arvo]]+Taulukko1[[#This Row],[Jäännös arvo]])/2","v":0},{"$f":"(Taulukko1[[#This Row],[Jälleenhankinta-arvo]]-Taulukko1[[#This Row],[Jäännös arvo]])/Taulukko1[[#This Row],[Kestoaika]]","v":{"$error":"#DIV/0!"}},{"$f":"$C$5*Taulukko1[[#This Row],[Jälleenhankinta-arvo]]","v":0},{"$f":"$C$6*Taulukko1[[#This Row],[Jälleenhankinta-arvo]]","v":0},null,{"$error":"#DIV/0!"},0,{"$f":"Taulukko1[[#This Row],[Vuotuiskustannus yhteensä €/v]]*Taulukko1[[#This Row],[Navetan/ peltyön osuus kustannuksista]]","v":{"$error":"#DIV/0!"}},null,{"$f":"Taulukko1[[#This Row],[Vuotuiskustannus yhteensä]]/Taulukko1[[#This Row],[Pellon määrä/laskettava kone]]","v":{"$error":"#DIV/0!"}}]
[null,"Kylvökone",null,null,null,{"$f":"Taulukko1[[#This Row],[Jälleenhankinta-arvo]]*Taulukko1[[#This Row],[JA% JHA:sta]]","v":0},{"$f":"$C$4*(Taulukko1[[#This Row],[Jälleenhankinta-arvo]]+Taulukko1[[#This Row],[Jäännös arvo]])/2","v":0},{"$f":"(Taulukko1[[#This Row],[Jälleenhankinta-arvo]]-Taulukko1[[#This Row],[Jäännös arvo]])/Taulukko1[[#This Row],[Kestoaika]]","v":{"$error":"#DIV/0!"}},{"$f":"$C$5*Taulukko1[[#This Row],[Jälleenhankinta-arvo]]","v":0},{"$f":"$C$6*Taulukko1[[#This Row],[Jälleenhankinta-arvo]]","v":0},null,{"$error":"#DIV/0!"},0,{"$f":"Taulukko1[[#This Row],[Vuotuiskustannus yhteensä €/v]]*Taulukko1[[#This Row],[Navetan/ peltyön osuus kustannuksista]]","v":{"$error":"#DIV/0!"}},null,{"$f":"Taulukko1[[#This Row],[Vuotuiskustannus yhteensä]]/Taulukko1[[#This Row],[Pellon määrä/laskettava kone]]","v":{"$error":"#DIV/0!"}}]
{"$rows_left_out":12}